{"text_format":"1","workbook":"xlsx","n_sheets":11,"sheets":["Lisier_porc","Lisier_vache","Description OAD","OAD","Lisier de vache","Lisier de porc","Base de données","Lisier de vache_72h","Lisier de porc__72h","Lisier de vache_72h-12h","Lisier de porc 72h-12h "],"not_rendered":{"charts":0,"images":5,"macros":1,"external_links":0,"defined_names":7,"comments":0,"pivot_tables":0},"unopened":[],"bounds":{"document_bytes":16777216,"sheet_cells":100000,"rows_first":2000,"rows_last":500,"rows_between":2000,"halvings":0,"cell_chars":16384,"cell_head_chars":4096},"cells_cut":0,"cells_raw":0,"read":"whole","date_system":"1900"}

{"sheet":"Lisier_porc","index":0,"n_rows":18,"n_cols":35,"rows_kept":18,"cut":false,"hidden":true,"merged":[]}
[]
[null,null,"IMPORTANT: pour les bases d'analyse, H correspond àun échantillon tel que reçu et S àun échantillon séché au laboratoire"]
[null,null,"Date de réception des échantillons: 2023-10-26"]
[null,null,"Date Echantillonnage: 10-08-2023"]
[null,"Base: ","H","H","H","H","H","S","S","S","S","S","S","S","H","H","H","H","H","H","H","H","H","H","H","H","H","H","H","H","H","H","H","H","H"]
[null,"Paramètre: ","501","502","503","504","506","507","507","507","507","509","509","509","512","520","520","520","520","520","520","520","520","520","520","520","520","520","520","520","520","520","520","520","520"]
[null,"Élément: ","pH *","N Total *","N-NH4 *","P Min HCl","Mat. Sèche *","Cendres *","M.O","C.O (1.724)","C.O (2.00)","C/N (1.724)","C/N (2.00)","NTK B.S.","Densité apparente","P","K","Ca","Mg","Al","B","Cu","Fe","Mn","Zn","Mo","Na","Ni","Cd","Cr","Co","Pb","S","Ba","Sr"]
[null,"Méthode: ","Eau","NTK","KCl 2 M","HCl 2,5 N","105o C","500o C","500o C","500o C","500o C","Calcul","Calcul","Calcul","Gravimét.","EPA-3050","EPA-3050","EPA-3050","EPA-3050","EPA-3050","EPA-3050","EPA-3050","EPA-3050","EPA-3050","EPA-3050","EPA-3050","EPA-3050","EPA-3050","EPA-3050","EPA-3050","EPA-3050","EPA-3050","EPA-3050","EPA-3050","EPA-3050"]
{"$rows_left_out":11}
{"sheet":"Lisier_vache","index":1,"n_rows":46,"n_cols":34,"rows_kept":46,"cut":false,"hidden":true,"merged":[]}
[]
[]
[]
[]
[]
[]
[]
[]
{"$rows_left_out":39}
{"sheet":"Description OAD","index":2,"n_rows":2,"n_cols":2,"rows_kept":2,"cut":false,"hidden":false,"merged":[[1,1,1,4]]}
[]
[null,"Lien vers la fiche téléchargeable"]

{"sheet":"OAD","index":3,"n_rows":13,"n_cols":11,"rows_kept":13,"cut":false,"hidden":false,"merged":[]}
[]
[]
[null,"Variables d'entrée","Valeurs d'entrée",null,"Variables de sortie","Valeur",null,"Prix 2025","Formule ","$/t","$/kg"]
[null,"Type de lisier","Vache",null,"Azote ammoniacal (N-NH4+) appliqué (kg/ha)",{"$f":"IF(C10=\"Non\",$C$13*$C$12,$C$11*$C$13)","v":35},null,"Nitrate d'ammonium calcique (CAN)","27-0-0",1012,{"$f":"J4/1000","v":1.012}]
[null,"Matière sèche (%)",7,null,"Perte d’azote sous forme de NH₃ après 12 h (% du N-NH₄+ appliqué)",{"$f":"_xlfn.XLOOKUP(1,('Base de données'!A:A=C4)*('Base de données'!B:B=C5)*('Base de données'!C:C=C6)*('Base de données'!D:D=C7)*('Base de données'!E:E=C8)*('Base de données'!F:F=C9),'Base de données'!G:G)","v":0.14699999999999999},null,"Urée","46-0-0",1102,{"$f":"J5/1000","v":1.1020000000000001}]
[null,"Méthode d'épandage","Aspersion basse",null,"Émission cumulative de N-NH₃ après 12 h (kg/ha)",{"$f":"F5*F4","v":5.1449999999999996}]
[null,"Incorporation","0h"]
[null,"Température (°C)",30]
{"$rows_left_out":6}
{"sheet":"Lisier de vache","index":4,"n_rows":78,"n_cols":42,"rows_kept":78,"cut":false,"hidden":false,"merged":[[40,1,40,2],[40,22,40,23],[6,39,6,41],[5,27,6,29],[5,30,5,35],[5,36,5,41],[6,9,6,11],[6,12,6,14],[6,15,6,17],[6,18,6,20],[6,30,6,32],[6,33,6,35],[6,36,6,38],[46,30,46,32],[45,22,46,23],[46,36,46,38],[46,39,46,41],[45,24,46,26],[45,27,46,29],[45,30,45,35],[45,36,45,41],[46,33,46,35],[45,1,46,2],[45,3,46,5],[45,6,46,8],[45,9,45,14],[45,15,45,20],[46,9,46,11],[46,12,46,14],[46,15,46,17],[46,18,46,20],[0,1,0,2],[0,22,0,23],[5,22,6,23],[5,24,6,26],[5,1,6,2],[5,3,6,5],[5,6,6,8],[5,9,5,14],[5,15,5,20],[41,9,41,10],[42,9,42,10],[43,9,43,10],[41,30,41,31],[42,30,42,31],[43,30,43,31],[1,30,1,31],[2,30,2,31],[3,30,3,31],[1,9,1,10],[2,9,2,10],[3,9,3,10]]}
[null,"LISIER DE VACHE",null,null,null,null,null,null,null,null,null,null,null,null,null,null,null,null,null,null,null,null,"LISIER DE VACHE"]
[null,"M.S (%)",3.5,null,null,null,null,null,null,"Prix 2025",null,"Formule ","$/t","$/kg",null,null,null,null,null,null,null,null,"M.S (%)",3.5,null,null,null,null,null,null,"Prix 2025",null,"Formule ","$/t","$/kg"]
[null,"N total (kg/t)",2.6,null,null,null,null,null,null,"Nitrate d'ammonium calcique (CAN)",null,"27-0-0",1012,{"$f":"M3/1000","v":1.012},null,null,null,null,null,null,null,null,"N total (kg/t)",2.6,null,null,null,null,null,null,"Nitrate d'ammonium calcique (CAN)",null,"27-0-0",1012,{"$f":"AH3/1000","v":1.012}]
[null,"Azote ammoniacal total ou N-NH4+ (kg/t)",1.4,null,null,null,null,null,null,"Urée",null,"46-0-0",1102,{"$f":"M4/1000","v":1.1020000000000001},null,null,null,null,null,null,null,null,"Azote ammoniacal total ou N-NH4+ (kg/t)",1.4,null,null,null,null,null,null,"Urée",null,"46-0-0",1102,{"$f":"AH4/1000","v":1.1020000000000001}]
[]
[null,"Aspersion basse",null,"Pourcentage d’azote ammoniacal (% N-NH4+) appliqué qui est émis sous forme d’ammoniac (N-NH3) lors des 12 heures suivant l'épandage",null,null,"Émissions cumulatives de N-NH3 (kg/t de lisier épandu)",null,null,{"$f":"$J$3","v":"Nitrate d'ammonium calcique (CAN)"},null,null,null,null,null,{"$f":"$J$4","v":"Urée"},null,null,null,null,null,null,"Pendillards",null,"Pourcentage d’azote ammoniacal (% N-NH4+) appliqué qui est émis sous forme d’ammoniac (N-NH3) lors des 12 heures suivant l'épandage",null,null,"Émissions cumulatives de N-NH3 (kg/t de lisier épandu)",null,null,{"$f":"$J$3","v":"Nitrate d'ammonium calcique (CAN)"},null,null,null,null,null,{"$f":"$J$4","v":"Urée"}]
[null,null,null,null,null,null,null,null,null,"Masse de fertilisant requise pour compenser l'azote perdu (kg/t de lisier épandu)",null,null,"$/t de lisier épandu",null,null,"Masse de fertilisant requise pour compenser l'azote perdu (kg/t de lisier épandu)",null,null,"$/t de lisier épandu",null,null,null,null,null,null,null,null,null,null,null,"Masse de fertilisant requise pour compenser l'azote perdu (kg/t de lisier épandu)",null,null,"$/t de lisier épandu",null,null,"Masse de fertilisant requise pour compenser l'azote perdu (kg/t de lisier épandu)",null,null,"$/t de lisier épandu"]
[null,"Vitesse du vent (km/h)",5,null,null,null,null,null,null,null,null,null,null,null,null,null,null,null,null,null,null,null,"Vitesse du vent (km/h)",5]
{"$rows_left_out":71}
{"sheet":"Lisier de porc","index":5,"n_rows":78,"n_cols":42,"rows_kept":78,"cut":false,"hidden":false,"merged":[[40,1,40,2],[40,22,40,23],[46,30,46,32],[45,22,46,23],[46,36,46,38],[45,1,46,2],[45,3,46,5],[45,6,46,8],[45,9,45,14],[45,15,45,20],[46,9,46,11],[46,12,46,14],[46,15,46,17],[46,18,46,20],[41,9,41,10],[42,9,42,10],[46,39,46,41],[45,24,46,26],[45,27,46,29],[45,30,45,35],[45,36,45,41],[46,33,46,35],[6,33,6,35],[6,36,6,38],[6,39,6,41],[5,27,6,29],[5,30,5,35],[5,36,5,41],[0,22,0,23],[0,1,0,2],[5,1,6,2],[5,3,6,5],[5,6,6,8],[5,9,5,14],[5,15,5,20],[6,18,6,20],[5,22,6,23],[6,12,6,14],[6,15,6,17],[6,9,6,11],[43,9,43,10],[1,30,1,31],[2,30,2,31],[3,30,3,31],[41,30,41,31],[42,30,42,31],[43,30,43,31],[2,9,2,10],[3,9,3,10],[1,9,1,10],[5,24,6,26],[6,30,6,32]]}
[null,"LISIER DE PORC",null,null,null,null,null,null,null,null,null,null,null,null,null,null,null,null,null,null,null,null,"LISIER DE PORC"]
[null,"M.S (%)",3.5,null,null,null,null,null,null,"Prix 2025",null,"Formule ","$/t","$/kg",null,null,null,null,null,null,null,null,"M.S (%)",3.5,null,null,null,null,null,null,"Prix 2025",null,"Formule ","$/t","$/kg"]
[null,"N total (kg/t)",3.5,null,null,null,null,null,null,"Nitrate d'ammonium calcique (CAN)",null,"27-0-0",1012,{"$f":"M3/1000","v":1.012},null,null,null,null,null,null,null,null,"N total (kg/t)",3.5,null,null,null,null,null,null,"Nitrate d'ammonium calcique (CAN)",null,"27-0-0",1012,{"$f":"AH3/1000","v":1.012}]
[null,"Azote ammoniacal total ou N-NH4+ (kg/t)",2.4,null,null,null,null,null,null,"Urée",null,"46-0-0",1102,{"$f":"M4/1000","v":1.1020000000000001},null,null,null,null,null,null,null,null,"Azote ammoniacal total ou N-NH4+ (kg/t)",2.4,null,null,null,null,null,null,"Urée",null,"46-0-0",1102,{"$f":"AH4/1000","v":1.1020000000000001}]
[]
[null,"Aspersion basse",null,"Pourcentage d’azote ammoniacal (% N-NH4+) appliqué qui est émis sous forme d’ammoniac (N-NH3) lors des 12 heures suivant l'épandage",null,null,"Émissions cumulatives de N-NH3 (kg/t de lisier épandu)",null,null,{"$f":"$J$3","v":"Nitrate d'ammonium calcique (CAN)"},null,null,null,null,null,{"$f":"$J$4","v":"Urée"},null,null,null,null,null,null,"Pendillards",null,"Pourcentage d’azote ammoniacal (% N-NH4+) appliqué qui est émis sous forme d’ammoniac (N-NH3) lors des 12 heures suivant l'épandage",null,null,"Émissions cumulatives de N-NH3 (kg/t de lisier épandu)",null,null,{"$f":"$J$3","v":"Nitrate d'ammonium calcique (CAN)"},null,null,null,null,null,{"$f":"$J$4","v":"Urée"}]
[null,null,null,null,null,null,null,null,null,"Masse de fertilisant requise pour compenser l'azote perdu (kg/t de lisier épandu)",null,null,"$/t de lisier épandu",null,null,"Masse de fertilisant requise pour compenser l'azote perdu (kg/t de lisier épandu)",null,null,"$/t de lisier épandu",null,null,null,null,null,null,null,null,null,null,null,"Masse de fertilisant requise pour compenser l'azote perdu (kg/t de lisier épandu)",null,null,"$/t de lisier épandu",null,null,"Masse de fertilisant requise pour compenser l'azote perdu (kg/t de lisier épandu)",null,null,"$/t de lisier épandu"]
[null,"Vitesse du vent (km/h)",5,null,null,null,null,null,null,null,null,null,null,null,null,null,null,null,null,null,null,null,"Vitesse du vent (km/h)",5]
{"$rows_left_out":71}
{"sheet":"Base de données","index":6,"n_rows":481,"n_cols":16,"rows_kept":481,"cut":false,"hidden":true,"merged":[]}
["Type fumier","M.S","Méthode","Incorporé","Température","Vent","% pertes"]
["Vache",3.5,"Aspersion basse","0h",10,5,{"$f":"'Lisier de vache'!D10/100","v":4.8000000000000001E-2},null,null,"Prix 2025","Formule","%",null,"Analyses ","Oui","--------"]
["Vache",3.5,"Aspersion basse","3h",10,5,{"$f":"'Lisier de vache'!D11/100","v":9.6999999999999989E-2},null,null,"Nitrate d'ammonium calcique (CAN)","27-0-0",0.27,null,null,"Non"]
["Vache",3.5,"Aspersion basse","6h",10,5,{"$f":"'Lisier de vache'!D12/100","v":0.129},null,null,"Urée","46-0-0",0.46]
["Vache",3.5,"Aspersion basse","12h",10,5,{"$f":"'Lisier de vache'!D13/100","v":0.161}]
["Vache",3.5,"Aspersion basse","Sans",10,5,{"$f":"'Lisier de vache'!D14/100","v":0.161}]
["Vache",3.5,"Aspersion basse","0h",20,5,{"$f":"'Lisier de vache'!E10/100","v":6.0999999999999999E-2}]
["Vache",3.5,"Aspersion basse","3h",20,5,{"$f":"'Lisier de vache'!E11/100","v":0.155}]
{"$rows_left_out":474}
{"sheet":"Lisier de vache_72h","index":7,"n_rows":78,"n_cols":42,"rows_kept":78,"cut":false,"hidden":true,"merged":[[45,36,45,41],[46,9,46,11],[46,12,46,14],[46,15,46,17],[46,18,46,20],[46,30,46,32],[46,33,46,35],[46,36,46,38],[46,39,46,41],[43,9,43,10],[43,30,43,31],[45,1,46,2],[45,3,46,5],[45,6,46,8],[45,9,45,14],[45,15,45,20],[45,22,46,23],[45,24,46,26],[45,27,46,29],[45,30,45,35],[40,1,40,2],[40,22,40,23],[41,9,41,10],[41,30,41,31],[42,9,42,10],[42,30,42,31],[5,36,5,41],[6,9,6,11],[6,12,6,14],[6,15,6,17],[6,18,6,20],[6,30,6,32],[6,33,6,35],[6,36,6,38],[6,39,6,41],[3,9,3,10],[3,30,3,31],[5,1,6,2],[5,3,6,5],[5,6,6,8],[5,9,5,14],[5,15,5,20],[5,22,6,23],[5,24,6,26],[5,27,6,29],[5,30,5,35],[0,1,0,2],[0,22,0,23],[1,9,1,10],[1,30,1,31],[2,9,2,10],[2,30,2,31]]}
[null,"LISIER DE VACHE",null,null,null,null,null,null,null,null,null,null,null,null,null,null,null,null,null,null,null,null,"LISIER DE VACHE"]
[null,"M.S (%)",3.5,null,null,null,null,null,null,"Prix 2025",null,"Formule ","$/t","$/kg",null,null,null,null,null,null,null,null,"M.S (%)",3.5,null,null,null,null,null,null,"Prix 2025",null,"Formule ","$/t","$/kg"]
[null,"N total (kg/t)",2.6,null,null,null,null,null,null,"Nitrate d'ammonium calcique (CAN)",null,"27-0-0",1012,{"$f":"M3/1000","v":1.012},null,null,null,null,null,null,null,null,"N total (kg/t)",2.6,null,null,null,null,null,null,"Nitrate d'ammonium calcique (CAN)",null,"27-0-0",1012,{"$f":"AH3/1000","v":1.012}]
[null,"Azote ammoniacal total ou N-NH4+ (kg/t)",1.4,null,null,null,null,null,null,"Urée",null,"46-0-0",1102,{"$f":"M4/1000","v":1.1020000000000001},null,null,null,null,null,null,null,null,"Azote ammoniacal total ou N-NH4+ (kg/t)",1.4,null,null,null,null,null,null,"Urée",null,"46-0-0",1102,{"$f":"AH4/1000","v":1.1020000000000001}]
[]
[null,"Aspersion basse",null,"Pourcentage d’azote ammoniacal (% N-NH4+) appliqué qui est émis sous forme d’ammoniac (N-NH3) lors des 72 heures suivant l'épandage",null,null,"Émissions cumulatives de N-NH3 (kg/t de lisier épandu)",null,null,{"$f":"$J$3","v":"Nitrate d'ammonium calcique (CAN)"},null,null,null,null,null,{"$f":"$J$4","v":"Urée"},null,null,null,null,null,null,"Pendillards",null,"Pourcentage d’azote ammoniacal (% N-NH4+) appliqué qui est émis sous forme d’ammoniac (N-NH3) lors des 72 heures suivant l'épandage",null,null,"Émissions cumulatives de N-NH3 (kg/t de lisier épandu)",null,null,{"$f":"$J$3","v":"Nitrate d'ammonium calcique (CAN)"},null,null,null,null,null,{"$f":"$J$4","v":"Urée"}]
[null,null,null,null,null,null,null,null,null,"Masse de fertilisant requise pour compenser l'azote perdu (kg/t de lisier épandu)",null,null,"$/t de lisier épandu",null,null,"Masse de fertilisant requise pour compenser l'azote perdu (kg/t de lisier épandu)",null,null,"$/t de lisier épandu",null,null,null,null,null,null,null,null,null,null,null,"Masse de fertilisant requise pour compenser l'azote perdu (kg/t de lisier épandu)",null,null,"$/t de lisier épandu",null,null,"Masse de fertilisant requise pour compenser l'azote perdu (kg/t de lisier épandu)",null,null,"$/t de lisier épandu"]
[null,"Vitesse du vent (km/h)",5,null,null,null,null,null,null,null,null,null,null,null,null,null,null,null,null,null,null,null,"Vitesse du vent (km/h)",5]
{"$rows_left_out":71}
{"sheet":"Lisier de porc__72h","index":8,"n_rows":78,"n_cols":42,"rows_kept":78,"cut":false,"hidden":true,"merged":[[45,36,45,41],[46,9,46,11],[46,12,46,14],[46,15,46,17],[46,18,46,20],[46,30,46,32],[46,33,46,35],[46,36,46,38],[46,39,46,41],[43,9,43,10],[43,30,43,31],[45,1,46,2],[45,3,46,5],[45,6,46,8],[45,9,45,14],[45,15,45,20],[45,22,46,23],[45,24,46,26],[45,27,46,29],[45,30,45,35],[40,1,40,2],[40,22,40,23],[41,9,41,10],[41,30,41,31],[42,9,42,10],[42,30,42,31],[5,36,5,41],[6,9,6,11],[6,12,6,14],[6,15,6,17],[6,18,6,20],[6,30,6,32],[6,33,6,35],[6,36,6,38],[6,39,6,41],[3,9,3,10],[3,30,3,31],[5,1,6,2],[5,3,6,5],[5,6,6,8],[5,9,5,14],[5,15,5,20],[5,22,6,23],[5,24,6,26],[5,27,6,29],[5,30,5,35],[0,1,0,2],[0,22,0,23],[1,9,1,10],[1,30,1,31],[2,9,2,10],[2,30,2,31]]}
[null,"LISIER DE PORC",null,null,null,null,null,null,null,null,null,null,null,null,null,null,null,null,null,null,null,null,"LISIER DE PORC"]
[null,"M.S (%)",3.5,null,null,null,null,null,null,"Prix 2025",null,"Formule ","$/t","$/kg",null,null,null,null,null,null,null,null,"M.S (%)",3.5,null,null,null,null,null,null,"Prix 2025",null,"Formule ","$/t","$/kg"]
[null,"N total (kg/t)",3.5,null,null,null,null,null,null,"Nitrate d'ammonium calcique (CAN)",null,"27-0-0",1012,{"$f":"M3/1000","v":1.012},null,null,null,null,null,null,null,null,"N total (kg/t)",3.5,null,null,null,null,null,null,"Nitrate d'ammonium calcique (CAN)",null,"27-0-0",1012,{"$f":"AH3/1000","v":1.012}]
[null,"Azote ammoniacal total ou N-NH4+ (kg/t)",2.4,null,null,null,null,null,null,"Urée",null,"46-0-0",1102,{"$f":"M4/1000","v":1.1020000000000001},null,null,null,null,null,null,null,null,"Azote ammoniacal total ou N-NH4+ (kg/t)",2.4,null,null,null,null,null,null,"Urée",null,"46-0-0",1102,{"$f":"AH4/1000","v":1.1020000000000001}]
[]
[null,"Aspersion basse",null,"Pourcentage d’azote ammoniacal (% N-NH4+) appliqué qui est émis sous forme d’ammoniac (N-NH3) lors des 72 heures suivant l'épandage",null,null,"Émissions cumulatives de N-NH3 (kg/t de lisier épandu)",null,null,{"$f":"$J$3","v":"Nitrate d'ammonium calcique (CAN)"},null,null,null,null,null,{"$f":"$J$4","v":"Urée"},null,null,null,null,null,null,"Pendillards",null,"Pourcentage d’azote ammoniacal (% N-NH4+) appliqué qui est émis sous forme d’ammoniac (N-NH3) lors des 72 heures suivant l'épandage",null,null,"Émissions cumulatives de NH3 (kg/t_lisier_épandu)",null,null,{"$f":"$J$3","v":"Nitrate d'ammonium calcique (CAN)"},null,null,null,null,null,{"$f":"$J$4","v":"Urée"}]
[null,null,null,null,null,null,null,null,null,"Masse de fertilisant requise pour compenser l'azote perdu (kg/t de lisier épandu)",null,null,"$/t de lisier épandu",null,null,"Masse de fertilisant requise pour compenser l'azote perdu (kg/t de lisier épandu)",null,null,"$/t de lisier épandu",null,null,null,null,null,null,null,null,null,null,null,"Masse de fertilisant requise pour compenser l'azote perdu (kg/t de lisier épandu)",null,null,"$/t de lisier épandu",null,null,"Masse de fertilisant requise pour compenser l'azote perdu (kg/t de lisier épandu)",null,null,"$/t de lisier épandu"]
[null,"Vitesse du vent (km/h)",5,null,null,null,null,null,null,null,null,null,null,null,null,null,null,null,null,null,null,null,"Vitesse du vent (km/h)",5]
{"$rows_left_out":71}
{"sheet":"Lisier de vache_72h-12h","index":9,"n_rows":78,"n_cols":12,"rows_kept":78,"cut":false,"hidden":true,"merged":[[5,9,6,11],[40,1,40,2],[40,7,40,8],[45,1,46,2],[45,3,46,5],[45,7,46,8],[45,9,46,11],[0,1,0,2],[0,7,0,8],[5,1,6,2],[5,3,6,5],[5,7,6,8]]}
[null,"LISIER DE VACHE",null,null,null,null,null,"LISIER DE VACHE"]
[null,"M.S (%)",3.5,null,null,null,null,"M.S (%)",3.5]
[null,"N total (kg/t)",2.6,null,null,null,null,"N total (kg/t)",2.6]
[null,"Azote ammoniacal total ou N-NH4+ (kg/t)",1.4,null,null,null,null,"Azote ammoniacal total ou N-NH4+ (kg/t)",1.4]
[]
[null,"Aspersion basse",null,"Ratio des émissions cumulatives de NH3 (kg/t_lisier_épandu) à 12h et 72h",null,null,null,"Pendillards",null,"Pourcentage d’azote ammoniacal (% N-NH4+) appliqué qui est émis sous forme d’ammoniac (N-NH3) lors des 72 heures suivant l'épandage"]
[]
[null,"Vitesse du vent (km/h)",5,null,null,null,null,"Vitesse du vent (km/h)",5]
{"$rows_left_out":71}
{"sheet":"Lisier de porc 72h-12h ","index":10,"n_rows":78,"n_cols":23,"rows_kept":78,"cut":false,"hidden":true,"merged":[[45,9,46,11],[0,1,0,2],[0,7,0,8],[5,1,6,2],[5,3,6,5],[5,7,6,8],[5,9,6,11],[40,1,40,2],[40,7,40,8],[45,1,46,2],[45,3,46,5],[45,7,46,8]]}
[null,"LISIER DE PORC",null,null,null,null,null,"LISIER DE PORC"]
[null,"M.S (%)",3.5,null,null,null,null,"M.S (%)",3.5]
[null,"N total (kg/t)",3.5,null,null,null,null,"N total (kg/t)",3.5]
[null,"Azote ammoniacal total ou N-NH4+ (kg/t)",2.4,null,null,null,null,"Azote ammoniacal total ou N-NH4+ (kg/t)",2.4]
[]
[null,"Aspersion basse",null,"Ratio des émissions cumulatives de NH3 (kg/t_lisier_épandu) à 12h et 72h",null,null,null,"Pendillards",null,"Ratio des émissions cumulatives de NH3 (kg/t_lisier_épandu) à 12h et 72h",null,null,null,null,null,null,null,null,"Fumier","Incorporation","M.S","% de pertes mimimal ","% de pertes maximal"]
[null,null,null,null,null,null,null,null,null,null,null,null,null,null,null,null,null,null,"Porc","inmediate",3,0.37,0.47]
[null,"Vitesse du vent (km/h)",5,null,null,null,null,"Vitesse du vent (km/h)",5,null,null,null,null,null,null,null,null,null,"Porc","après 3h",3,0.5,0.77]
{"$rows_left_out":70}